Target
Adenosine receptor A1
Ligand
BDBM50237081
Substrate
Meas. Tech.
ChEMBL_463077 (CHEMBL928987)
Ki
180±n/a nM
Citation
 Zhang, XRueter, JKChen, YMoorjani, MLanier, MCLin, EGross, RSTellew, JEWilliams, JPLechner, SMMarkison, SJoswig, TMalany, SSantos, MCastro-Palomino, JCCrespo, MIPrat, MGual, SDíaz, JLSaunders, JSlee, DH Synthesis of N-pyrimidinyl-2-phenoxyacetamides as adenosine A2A receptor antagonists. Bioorg Med Chem Lett 18:1778-83 (2008)  
Target
Name:
Adenosine receptor A1
Synonyms:
A1 adenosine receptor (hA1) AA1R_HUMAN ADORA1 Adenosine A1-receptor Adenosine receptor A1 (hA1) | Adenosine transporter (AdT)
Type:
G Protein-Coupled Receptor (GPCR)
Mol. Mass.:
36520.92
Organism:
Homo sapiens (Human)
Description:
P30542
Residue:
326
  
Inhibitor
Name:
BDBM50237081
Synonyms:
2-(3-fluorophenoxy)-N-(2-(pyridin-2-yl)-6-(thiazol-2-yl)pyrimidin-4-yl)acetamide | CHEMBL255699
Type:
Small organic molecule
Emp. Form.:
C20H14FN5O2S
Mol. Mass.:
407.421
SMILES:
Fc1cccc(OCC(=O)Nc2cc(nc(n2)-c2ccccn2)-c2nccs2)c1
: