Target
Adenosine receptor A1
Ligand
BDBM50237094
Substrate
Meas. Tech.
ChEMBL_463077 (CHEMBL928987)
Ki
120±n/a nM
Citation
 Zhang, XRueter, JKChen, YMoorjani, MLanier, MCLin, EGross, RSTellew, JEWilliams, JPLechner, SMMarkison, SJoswig, TMalany, SSantos, MCastro-Palomino, JCCrespo, MIPrat, MGual, SDíaz, JLSaunders, JSlee, DH Synthesis of N-pyrimidinyl-2-phenoxyacetamides as adenosine A2A receptor antagonists. Bioorg Med Chem Lett 18:1778-83 (2008)  
Target
Name:
Adenosine receptor A1
Synonyms:
A1 adenosine receptor (hA1) AA1R_HUMAN ADORA1 Adenosine A1-receptor Adenosine receptor A1 (hA1) | Adenosine transporter (AdT)
Type:
G Protein-Coupled Receptor (GPCR)
Mol. Mass.:
36520.92
Organism:
Homo sapiens (Human)
Description:
P30542
Residue:
326
  
Inhibitor
Name:
BDBM50237094
Synonyms:
CHEMBL256332 | N-(6-(3,5-dimethyl-1H-pyrazol-1-yl)-2-(5-methylfuran-2-yl)pyrimidin-4-yl)-2-(3-fluoro-5-(pyrrolidin-1-ylmethyl)phenoxy)acetamide
Type:
Small organic molecule
Emp. Form.:
C27H29FN6O3
Mol. Mass.:
504.556
SMILES:
Cc1cc(C)n(n1)-c1cc(NC(=O)COc2cc(F)cc(CN3CCCC3)c2)nc(n1)-c1ccc(C)o1
: