Target
Lactase/phlorizin hydrolase
Ligand
BDBM50234571
Substrate
Meas. Tech.
ChEMBL_548796 (CHEMBL1034287)
IC50
320000±n/a nM
Citation
 Asano, NKato, AMiyauchi, MKizu, HKameda, YWatson, AANash, RJFleet, GW Nitrogen-containing furanose and pyranose analogues from Hyacinthus orientalis. J Nat Prod 61:625-8 (1998)  
Target
Name:
Lactase/phlorizin hydrolase
Synonyms:
LPH_RAT Lct | Lph
Type:
PROTEIN
Mol. Mass.:
217253.31
Organism:
Rattus norvegicus
Description:
ChEMBL_96426
Residue:
1928
  
Inhibitor
Name:
BDBM50234571
Synonyms:
2,5-imino-2,5,6-trideoxy-D-manno-heptitol | CHEMBL407337
Type:
Small organic molecule
Emp. Form.:
C7H15NO4
Mol. Mass.:
177.1983
SMILES:
OCC[C@H]1N[C@H](CO)[C@@H](O)[C@@H]1O
: