Target
Lysosomal alpha-glucosidase
Ligand
BDBM50016703
Substrate
Meas. Tech.
ChEMBL_486571 (CHEMBL1018340)
IC50
55000±n/a nM
Citation
 Yasuda, KKizu, HYamashita, TKameda, YKato, ANash, RJFleet, GWMolyneux, RJAsano, N New sugar-mimic alkaloids from the pods of Angylocalyx pynaertii. J Nat Prod 65:198-202 (2002)  
Target
Name:
Lysosomal alpha-glucosidase
Synonyms:
Acidic alpha-glucosidase LYAG_RAT
Type:
PROTEIN
Mol. Mass.:
106191.24
Organism:
Rattus norvegicus
Description:
ChEMBL_1506157
Residue:
953
  
Inhibitor
Name:
BDBM50016703
Synonyms:
2-Hydroxymethyl-pyrrolidine-3,4-diol CHEMBL80254 | Imino-D-Arabinitol
Type:
Small organic molecule
Emp. Form.:
C5H11NO3
Mol. Mass.:
133.1457
SMILES:
OC[C@H]1NC[C@@H](O)[C@@H]1O
: