Target
Tissue alpha-L-fucosidase
Ligand
BDBM50278884
Substrate
Meas. Tech.
ChEMBL_545878 (CHEMBL1034393)
IC50
23000±n/a nM
Citation
 Yamashita, TYasuda, KKizu, HKameda, YWatson, AANash, RJFleet, GWAsano, N New polyhydroxylated pyrrolidine, piperidine, and pyrrolizidine alkaloids from Scilla sibirica. J Nat Prod 65:1875-81 (2002)  
Target
Name:
Tissue alpha-L-fucosidase
Synonyms:
Alpha-L-fucosidase 1 FUCO_BOVIN
Type:
PROTEIN
Mol. Mass.:
54093.12
Organism:
Bos taurus
Description:
ChEMBL_335897
Residue:
468
  
Inhibitor
Name:
BDBM50278884
Synonyms:
(1R*,2R*,3R*,5R*,7S*,7a*R)-3-hydroxymethyl-5-methyl-1,2,7-trihydroxypyrrolizidine | CHEMBL523761
Type:
Small organic molecule
Emp. Form.:
C9H17NO4
Mol. Mass.:
203.2356
SMILES:
C[C@@H]1C[C@H](O)[C@@H]2[C@@H](O)[C@H](O)[C@@H](CO)N12
: