Target
Prostaglandin G/H synthase 1
Ligand
BDBM50269644
Substrate
Meas. Tech.
ChEMBL_551732 (CHEMBL998269)
IC50
>100000±n/a nM
Citation
 Zou, JJin, DChen, WWang, JLiu, QZhu, XZhao, W Selective cyclooxygenase-2 inhibitors from Calophyllum membranaceum. J Nat Prod 68:1514-8 (2005)  
Target
Name:
Prostaglandin G/H synthase 1
Synonyms:
COX-1 Cyclooxygenase Cyclooxygenase-1 (COX-1) PTGS1 | Prostaglandin G/H synthase (cyclooxygenase)
Type:
Enzyme
Mol. Mass.:
68692.62
Organism:
Homo sapiens (Human)
Description:
P23219
Residue:
599
  
Inhibitor
Name:
BDBM50269644
Synonyms:
2,6-dihydroxy-1,7-dimethoxyxanthone | CHEMBL463769
Type:
Small organic molecule
Emp. Form.:
C15H12O6
Mol. Mass.:
288.2522
SMILES:
COc1cc2c(cc1O)oc1ccc(O)c(OC)c1c2=O
: