Target
Cannabinoid receptor 2
Ligand
BDBM50234418
Substrate
Meas. Tech.
ChEMBL_531313 (CHEMBL989725)
Ki
12±n/a nM
Citation
 Moloney, GPAngus, JARobertson, ADStoermer, MJRobinson, MWright, CEMcRae, KChristopoulos, A Synthesis and cannabinoid activity of 1-substituted-indole-3-oxadiazole derivatives: novel agonists for the CB1 receptor. Eur J Med Chem 43:513-39 (2008)  
Target
Name:
Cannabinoid receptor 2
Synonyms:
CANNABINOID CB2 CB2 CB2B CNR2_HUMAN Cannabinoid CB2 receptor Cannabinoid receptor 2 (CB2R) | hCB2
Type:
G Protein-Coupled Receptor (GPCR)
Mol. Mass.:
39690.94
Organism:
Homo sapiens (Human)
Description:
P34972
Residue:
360
  
Inhibitor
Name:
BDBM50234418
Synonyms:
(2,3-Dichloro-phenyl)-[5-methoxy-2-methyl-3-(2-morpholin-4-yl-ethyl)-indol-1-yl]-methanone CHEMBL73711 L-768242
Type:
Small organic molecule
Emp. Form.:
C23H24Cl2N2O3
Mol. Mass.:
447.354
SMILES:
COc1ccc2n(C(=O)c3cccc(Cl)c3Cl)c(C)c(CCN3CCOCC3)c2c1
: