Target
Cytochrome P450 2B6
Ligand
BDBM50258200
Substrate
Meas. Tech.
ChEMBL_497353 (CHEMBL999392)
IC50
24800±n/a nM
Citation
 Appiah-Opong, Rde Esch, ICommandeur, JNAndarini, MVermeulen, NP Structure-activity relationships for the inhibition of recombinant human cytochromes P450 by curcumin analogues. Eur J Med Chem 43:1621-31 (2008)  
Target
Name:
Cytochrome P450 2B6
Synonyms:
CP2B6_HUMAN Cytochrome P450 2B6 (CYP2B6)
Type:
Protein
Mol. Mass.:
56289.75
Organism:
Homo sapiens (Human)
Description:
P20813
Residue:
491
  
Inhibitor
Name:
BDBM50258200
Synonyms:
(1E,4E)-1,5-bis(4-hydroxy-3,5-dimethoxyphenyl)penta-1,4-dien-3-one CHEMBL493001 | Go-Y026
Type:
Small organic molecule
Emp. Form.:
C21H22O7
Mol. Mass.:
386.3952
SMILES:
COc1cc(\C=C\C(=O)\C=C\c2cc(OC)c(O)c(OC)c2)cc(OC)c1O
: