Target
Cytochrome P450 2B6
Ligand
BDBM50237760
Substrate
Meas. Tech.
ChEMBL_497353 (CHEMBL999392)
IC50
44800±n/a nM
Citation
 Appiah-Opong, Rde Esch, ICommandeur, JNAndarini, MVermeulen, NP Structure-activity relationships for the inhibition of recombinant human cytochromes P450 by curcumin analogues. Eur J Med Chem 43:1621-31 (2008)  
Target
Name:
Cytochrome P450 2B6
Synonyms:
CP2B6_HUMAN Cytochrome P450 2B6 (CYP2B6)
Type:
Protein
Mol. Mass.:
56289.75
Organism:
Homo sapiens (Human)
Description:
P20813
Residue:
491
  
Inhibitor
Name:
BDBM50237760
Synonyms:
1,5-bis(4-hydroxy-3,5-dimethylphenyl)penta-1,4-dien-3-one | CHEMBL407034
Type:
Small organic molecule
Emp. Form.:
C21H22O3
Mol. Mass.:
322.3976
SMILES:
Cc1cc(\C=C\C(=O)\C=C\c2cc(C)c(O)c(C)c2)cc(C)c1O
: