Target
Tyrosine-protein kinase Lck
Ligand
BDBM50260890
Substrate
Meas. Tech.
ChEMBL_555656 (CHEMBL955810)
IC50
7.2±n/a nM
Citation
 Hu, ETasker, AWhite, RDKunz, RKHuman, JChen, NBürli, RHungate, RNovak, PItano, AZhang, XYu, VNguyen, YTudor, YPlant, MFlynn, SXu, YMeagher, KLWhittington, DANg, GY Discovery of aryl aminoquinazoline pyridones as potent, selective, and orally efficacious inhibitors of receptor tyrosine kinase c-Kit. J Med Chem 51:3065-8 (2008)  
Target
Name:
Tyrosine-protein kinase Lck
Synonyms:
2.7.10.2 LCK_HUMAN Leukocyte C-terminal Src kinase Lymphocyte-specific protein tyrosine kinase Protein YT16 Proto-oncogene tyrosine-protein kinase LCK T cell-specific protein-tyrosine kinase
Type:
Mol. Mass.:
57987.83
Organism:
Homo sapiens (Human)
Description:
P06239
Residue:
509
  
Inhibitor
Name:
BDBM50260890
Synonyms:
3-(2-aminoquinazolin-6-yl)-1-(4-tert-butylphenyl)-4-methylpyridin-2(1H)-one | CHEMBL496494
Type:
Small organic molecule
Emp. Form.:
C24H24N4O
Mol. Mass.:
384.4736
SMILES:
Cc1ccn(-c2ccc(cc2)C(C)(C)C)c(=O)c1-c1ccc2nc(N)ncc2c1
: