Target
Proto-oncogene tyrosine-protein kinase Src
Ligand
BDBM50260945
Substrate
Meas. Tech.
ChEMBL_555657 (CHEMBL955811)
IC50
170±n/a nM
Citation
 Hu, ETasker, AWhite, RDKunz, RKHuman, JChen, NBürli, RHungate, RNovak, PItano, AZhang, XYu, VNguyen, YTudor, YPlant, MFlynn, SXu, YMeagher, KLWhittington, DANg, GY Discovery of aryl aminoquinazoline pyridones as potent, selective, and orally efficacious inhibitors of receptor tyrosine kinase c-Kit. J Med Chem 51:3065-8 (2008)  
Target
Name:
Proto-oncogene tyrosine-protein kinase Src
Synonyms:
Calmodulin/Proto-oncogene tyrosine-protein kinase Src Proto-oncogene c-Src SRC SRC_HUMAN V-src sarcoma (Schmidt-Ruppin A-2) viral oncogene homolog (avian) p60-Src | pp60c-src
Type:
Protein
Mol. Mass.:
59838.60
Organism:
Homo sapiens (Human)
Description:
P12931
Residue:
536
  
Inhibitor
Name:
BDBM50260945
Synonyms:
CHEMBL496713 | ethyl 4-(3-(2-aminoquinazolin-6-yl)-4-methyl-2-oxopyridin-1(2H)-yl)benzoate
Type:
Small organic molecule
Emp. Form.:
C23H20N4O3
Mol. Mass.:
400.4299
SMILES:
CCOC(=O)c1ccc(cc1)-n1ccc(C)c(-c2ccc3nc(N)ncc3c2)c1=O
: