Target
Mast/stem cell growth factor receptor Kit
Ligand
BDBM50260941
Substrate
Meas. Tech.
ChEMBL_555653 (CHEMBL955807)
IC50
22±n/a nM
Citation
 Hu, ETasker, AWhite, RDKunz, RKHuman, JChen, NBürli, RHungate, RNovak, PItano, AZhang, XYu, VNguyen, YTudor, YPlant, MFlynn, SXu, YMeagher, KLWhittington, DANg, GY Discovery of aryl aminoquinazoline pyridones as potent, selective, and orally efficacious inhibitors of receptor tyrosine kinase c-Kit. J Med Chem 51:3065-8 (2008)  
Target
Name:
Mast/stem cell growth factor receptor Kit
Synonyms:
CD117 antigen KIT Mast/stem cell growth factor receptor Kit (cKIT) Proto-oncogene tyrosine-protein kinase Kit Stem cell growth factor receptor Tyrosine-protein kinase Kit c-kit v-kit Hardy-Zuckerman 4 feline sarcoma viral oncogene homolog
Type:
Protein
Mol. Mass.:
109869.37
Organism:
Homo sapiens (Human)
Description:
P10721
Residue:
976
  
Inhibitor
Name:
BDBM50260941
Synonyms:
3-(2-aminoquinazolin-6-yl)-1-(4-chloro-3-fluorophenyl)-4-methylpyridin-2(1H)-one | CHEMBL497754
Type:
Small organic molecule
Emp. Form.:
C20H14ClFN4O
Mol. Mass.:
380.803
SMILES:
Cc1ccn(-c2ccc(Cl)c(F)c2)c(=O)c1-c1ccc2nc(N)ncc2c1
: