Target
Dipeptidyl peptidase 4
Ligand
BDBM50178428
Substrate
Meas. Tech.
ChEMBL_553545 (CHEMBL958728)
Ki
2000±n/a nM
Citation
 Congreve, MChessari, GTisi, DWoodhead, AJ Recent developments in fragment-based drug discovery. J Med Chem 51:3661-80 (2008)  
Target
Name:
Dipeptidyl peptidase 4
Synonyms:
ADABP Adenosine deaminase complexing protein 2 CD_antigen=CD26 DPP4 DPPIV Dipeptidyl peptidase 4 (DPP IV) Dipeptidyl peptidase 4 (DPP4) Dipeptidyl peptidase 4 membrane form Dipeptidyl peptidase IV Dipeptidyl peptidase IV (DDP-IV) Dipeptidyl peptidase IV membrane form Dipeptidyl peptidase-IV (DPP-4) T-cell activation antigen CD26 | TP103
Type:
Enzyme
Mol. Mass.:
88271.01
Organism:
Homo sapiens (Human)
Description:
P27487
Residue:
766
  
Inhibitor
Name:
BDBM50178428
Synonyms:
(S)-2-amino-3-methyl-1-(pyrrolidin-1-yl)butan-1-one CHEMBL383705
Type:
Small organic molecule
Emp. Form.:
C9H18N2O
Mol. Mass.:
170.252
SMILES:
CC(C)[C@H](N)C(=O)N1CCCC1
: