Target
IgG receptor FcRn large subunit p51
Ligand
BDBM50270974
Substrate
Meas. Tech.
ChEMBL_552584 (CHEMBL956456)
IC50
100000±n/a nM
Citation
 Mezo, ARMcDonnell, KACastro, AFraley, C Structure-activity relationships of a peptide inhibitor of the human FcRn:human IgG interaction. Bioorg Med Chem 16:6394-405 (2008)  
Target
Name:
IgG receptor FcRn large subunit p51
Synonyms:
FCGRN_HUMAN FCRN
Type:
PROTEIN
Mol. Mass.:
39742.86
Organism:
Homo sapiens (Human)
Description:
ChEMBL_627631
Residue:
365
  
Inhibitor
Name:
BDBM50270974
Synonyms:
(2S)-1-{2-[(2S)-2-[(2S)-6-amino-2-{[(2S)-1-[(2S)-2-[(2S)-2-(2-{2-[(2S)-2-[(2S)-2-{2-[(2S,3R)-2-[(2S)-2-[(2S)-2-[(2S)-2-[(2S)-2-amino-4-carbamoylbutanamido]-5-carbamimidamidopentanamido]-3-phenylpropanamido]-4-carboxybutanamido]-3-hydroxybutanamido]acetamido}-3-(1H-imidazol-5-yl)propanamido]-3-phenylpropanamido]acetamido}acetamido)-4-methylpentanamido]-3-(4-hydroxyphenyl)propanoyl]pyrrolidin-2-yl]formamido}hexanamido]-3-carbamoylpropanamido]acetyl}pyrrolidine-2-carboxylic acid | CHEMBL508704
Type:
Small organic molecule
Emp. Form.:
C87H125N25O24
Mol. Mass.:
1905.0765
SMILES:
CC(C)C[C@H](NC(=O)CNC(=O)CNC(=O)[C@H](Cc1ccccc1)NC(=O)[C@H](Cc1cnc[nH]1)NC(=O)CNC(=O)[C@@H](NC(=O)[C@H](CCC(O)=O)NC(=O)[C@H](Cc1ccccc1)NC(=O)[C@H](CCCN=C(N)N)NC(=O)[C@@H](N)CCC(N)=O)[C@@H](C)O)C(=O)N[C@@H](Cc1ccc(O)cc1)C(=O)N1CCC[C@H]1C(=O)N[C@@H](CCCCN)C(=O)N[C@@H](CC(N)=O)C(=O)NCC(=O)N1CCC[C@H]1C(O)=O
: