Target
Coagulation factor X
Ligand
BDBM50243670
Substrate
Meas. Tech.
ChEMBL_491893 (CHEMBL946423)
Ki
0.074±n/a nM
Citation
 Qiao, JXCheney, DLAlexander, RSSmallwood, AMKing, SRHe, KRendina, ARLuettgen, JMKnabb, RMWexler, RRLam, PY Achieving structural diversity using the perpendicular conformation of alpha-substituted phenylcyclopropanes to mimic the bioactive conformation of ortho-substituted biphenyl P4 moieties: discovery of novel, highly potent inhibitors of Factor Xa. Bioorg Med Chem Lett 18:4118-23 (2008)  
Target
Name:
Coagulation factor X
Synonyms:
Activated coagulation factor X (FXa) Coagulation factor X precursor F10 Factor X heavy chain Factor Xa Stuart-Prower factor
Type:
Enzyme
Mol. Mass.:
54726.60
Organism:
Homo sapiens (Human)
Description:
Residue:
488
  
Inhibitor
Name:
BDBM50243670
Synonyms:
CHEMBL471734 | N-((1-(4-(1-(4-methoxyphenyl)-7-oxo-3-(trifluoromethyl)-4,5-dihydro-1H-pyrazolo[3,4-c]pyridin-6(7H)-yl)phenyl)cyclopropyl)methyl)-N-methylmethanesulfonamide
Type:
Small organic molecule
Emp. Form.:
C26H27F3N4O4S
Mol. Mass.:
548.577
SMILES:
COc1ccc(cc1)-n1nc(c2CCN(C(=O)c12)c1ccc(cc1)C1(CN(C)S(C)(=O)=O)CC1)C(F)(F)F
: