Target
Beta-1 adrenergic receptor
Ligand
BDBM50243484
Substrate
Meas. Tech.
ChEMBL_492275 (CHEMBL947243)
EC50
400±n/a nM
Citation
 Imanishi, MItou, SWashizuka, KHamashima, HNakajima, YAraki, TTomishima, YSakurai, MMatsui, SImamura, EUeshima, KYamamoto, TYamamoto, NIshikawa, HNakano, KUnami, NHamada, KMatsumura, YTakamura, FHattori, K Discovery of a novel series of biphenyl benzoic acid derivatives as highly potent and selective human beta3 adrenergic receptor agonists with good oral bioavailability. Part II. J Med Chem 51:4002-20 (2008)  
Target
Name:
Beta-1 adrenergic receptor
Synonyms:
ADRB1 ADRB1_HUMAN Beta-1 adrenoceptor adrenergic Beta1
Type:
G Protein-Coupled Receptor (GPCR)
Mol. Mass.:
51338.40
Organism:
Homo sapiens (Human)
Description:
P08588
Residue:
477
  
Inhibitor
Name:
BDBM50243484
Synonyms:
4-(2-{[(2R)-2-Hydroxy-2-phenylethyl]amino}ethoxy)-3-isobutyl-4-biphenylcarboxylic acid | CHEMBL460257
Type:
Small organic molecule
Emp. Form.:
C27H31NO5
Mol. Mass.:
449.5387
SMILES:
CC(C)COc1cc(ccc1C(O)=O)-c1ccc(OCCNC[C@H](O)c2ccccc2)cc1
: