Target
Beta-1 adrenergic receptor
Ligand
BDBM50243481
Substrate
Meas. Tech.
ChEMBL_492275 (CHEMBL947243)
EC50
52±n/a nM
Citation
 Imanishi, MItou, SWashizuka, KHamashima, HNakajima, YAraki, TTomishima, YSakurai, MMatsui, SImamura, EUeshima, KYamamoto, TYamamoto, NIshikawa, HNakano, KUnami, NHamada, KMatsumura, YTakamura, FHattori, K Discovery of a novel series of biphenyl benzoic acid derivatives as highly potent and selective human beta3 adrenergic receptor agonists with good oral bioavailability. Part II. J Med Chem 51:4002-20 (2008)  
Target
Name:
Beta-1 adrenergic receptor
Synonyms:
ADRB1 ADRB1_HUMAN Beta-1 adrenoceptor | adrenergic Beta1
Type:
G Protein-Coupled Receptor (GPCR)
Mol. Mass.:
51338.40
Organism:
Homo sapiens (Human)
Description:
P08588
Residue:
477
  
Inhibitor
Name:
BDBM50243481
Synonyms:
4-(2-{[(2R)-2-(3-Chlorophenyl)-2-hydroxyethyl]amino}ethoxy)-3-(cyclohexyloxy)-4-biphenylcarboxylic acid | CHEMBL461301
Type:
Small organic molecule
Emp. Form.:
C29H32ClNO5
Mol. Mass.:
510.021
SMILES:
O[C@@H](CNCCOc1ccc(cc1)-c1ccc(C(O)=O)c(OC2CCCCC2)c1)c1cccc(Cl)c1
: