Target
Sodium-dependent noradrenaline transporter
Ligand
BDBM50010884
Substrate
Meas. Tech.
ChEMBL_487422 (CHEMBL1020016)
IC50
32±n/a nM
Citation
 Mahaney, PEGavrin, LKTrybulski, EJStack, GPVu, TACohn, STYe, FBelardi, JKSantilli, AASabatucci, JPLeiter, JJohnston, GHBray, JABurroughs, KDCosmi, SALeventhal, LKoury, EJZhang, YMugford, CAHo, DMRosenzweig-Lipson, SJPlatt, BSmith, VADeecher, DC Structure-activity relationships of the cycloalkanol ethylamine scaffold: discovery of selective norepinephrine reuptake inhibitors. J Med Chem 51:4038-49 (2008)  
Target
Name:
Sodium-dependent noradrenaline transporter
Synonyms:
Monoamine transporter NET Noradrenaline Transporter (NET) Norepinephrine transporter protein (NET) SLC6A2 Sodium-dependent noradrenaline transporter (NET) | Solute carrier family 6 member 2
Type:
Multi-pass membrane protein
Mol. Mass.:
69337.72
Organism:
Homo sapiens (Human)
Description:
P23975
Residue:
617
  
Inhibitor
Name:
BDBM50010884
Synonyms:
1-(2-(dimethylamino)-1-(3-(trifluoromethyl)phenyl)ethyl)cyclohexanol CHEMBL99653
Type:
Small organic molecule
Emp. Form.:
C17H24F3NO
Mol. Mass.:
315.3738
SMILES:
CN(C)CC(c1cccc(c1)C(F)(F)F)C1(O)CCCCC1
: