Target
Adenosine kinase
Ligand
BDBM50241445
Substrate
Meas. Tech.
ChEMBL_491790 (CHEMBL937861)
Ki
28000±n/a nM
Citation
 Kim, YASharon, AChu, CKRais, RHAl Safarjalani, ONNaguib, FNel Kouni, MH Structure-activity relationships of 7-deaza-6-benzylthioinosine analogues as ligands of Toxoplasma gondii adenosine kinase. J Med Chem 51:3934-45 (2008)  
Target
Name:
Adenosine kinase
Synonyms:
ADK_TOXGO | AK
Type:
PROTEIN
Mol. Mass.:
38353.04
Organism:
Toxoplasma gondii
Description:
ChEMBL_629062
Residue:
363
  
Inhibitor
Name:
BDBM50241445
Synonyms:
(2R,3R,4S,5R)-2-(4-(benzylthio)-7H-pyrrolo[2,3-d]pyrimidin-7-yl)-5-(hydroxymethyl)-tetrahydrofuran-3,4-diol CHEMBL410476
Type:
Small organic molecule
Emp. Form.:
C18H19N3O4S
Mol. Mass.:
373.426
SMILES:
OC[C@H]1O[C@H]([C@H](O)[C@@H]1O)n1ccc2c(SCc3ccccc3)ncnc12
: