Target
Mu-type opioid receptor
Ligand
BDBM50139013
Substrate
Meas. Tech.
ChEMBL_487720 (CHEMBL1022745)
Ki
1.3±n/a nM
Citation
 Keresztes, ASzucs, MBorics, AKövér, KEForró, EFülöp, FTömböly, CPéter, APáhi, AFábián, GMurányi, MTóth, G New endomorphin analogues containing alicyclic beta-amino acids: influence on bioactive conformation and pharmacological profile. J Med Chem 51:4270-9 (2008)  
Target
Name:
Mu-type opioid receptor
Synonyms:
MOR-1 Mu-type opioid receptor (MOR) OPRM_RAT Opioid receptor B Ror-b
Type:
G Protein-Coupled Receptor (GPCR)
Mol. Mass.:
44503.11
Organism:
Rattus norvegicus (rat)
Description:
Competition binding assays were carried out using membrane preparations from transfected HN9.10 cells that constitutively expressed the mu opioid receptor.
Residue:
398
  
Inhibitor
Name:
BDBM50139013
Synonyms:
(S)-1-[(S)-2-Amino-3-(4-hydroxy-phenyl)-propionyl]-pyrrolidine-2-carboxylic acid [(S)-1-((S)-1-carbamoyl-2-phenyl-ethylcarbamoyl)-2-phenyl-ethyl]-amide 1-[(S)-2-Amino-3-(4-hydroxy-phenyl)-propionyl]-pyrrolidine-2-carboxylicacid[1-((S)-(S)-1-carbamoyl-2-phenyl-ethylcarbamoyl)-2-phenyl-ethyl]-amide H-Tyr-Pro-Phe-Phe-NH2 endomorphin-2
Type:
Small organic molecule
Emp. Form.:
C32H37N5O5
Mol. Mass.:
571.6667
SMILES:
N[C@@H](Cc1ccc(O)cc1)C(=O)N1CCC[C@H]1C(=O)N[C@@H](Cc1ccccc1)C(=O)N[C@@H](Cc1ccccc1)C(N)=O
: