Target
Inosine-5'-monophosphate dehydrogenase 1
Ligand
BDBM19265
Substrate
Meas. Tech.
ChEMBL_490551 (CHEMBL981157)
Ki
330±n/a nM
Citation
 Chen, LPetrelli, ROlesiak, MWilson, DJLabello, NPPankiewicz, KW Bis(sulfonamide) isosters of mycophenolic adenine dinucleotide analogues: inhibition of inosine monophosphate dehydrogenase. Bioorg Med Chem 16:7462-9 (2008)  
Target
Name:
Inosine-5'-monophosphate dehydrogenase 1
Synonyms:
IMDH1_HUMAN IMPD 1 IMPDH-I Inosine Monophosphate Dehydrogenase Type 1 (IMPDH1) | Inosine-5'-monophosphate dehydrogenase (IMPDH)
Type:
Enzyme
Mol. Mass.:
55407.70
Organism:
Homo sapiens (Human)
Description:
Recombinant IMPDH1 expressed in E. coli.
Residue:
514
  
Inhibitor
Name:
BDBM19265
Synonyms:
C2-Mycophenolic Adenine Dinucleotide (C2-MDA) [({[(2R,3S,4R,5R)-5-(6-amino-9H-purin-9-yl)-3,4-dihydroxyoxolan-2-yl]methoxy}(hydroxy)phosphoryl)methyl][2-(4-hydroxy-6-methoxy-7-methyl-3-oxo-1,3-dihydro-2-benzofuran-5-yl)ethoxy]phosphinic acid
Type:
Small organic molecule
Emp. Form.:
C23H29N5O13P2
Mol. Mass.:
645.4496
SMILES:
COc1c(C)c2COC(=O)c2c(O)c1CCOP(O)(=O)CP(O)(=O)OC[C@H]1O[C@H]([C@H](O)[C@@H]1O)n1cnc2c(N)ncnc12
: