Target
Cyclin-dependent kinase 2
Ligand
BDBM50263146
Substrate
Meas. Tech.
ChEMBL_490603 (CHEMBL984724)
IC50
8±n/a nM
Citation
 Finlay, MRActon, DGAndrews, DMBarker, AJDennis, MFisher, EGraham, MAGreen, CPHeaton, DWKaroutchi, GLoddick, SAMorgentin, RRoberts, ATucker, JAWeir, HM Imidazole piperazines: SAR and development of a potent class of cyclin-dependent kinase inhibitors with a novel binding mode. Bioorg Med Chem Lett 18:4442-6 (2008)  
Target
Name:
Cyclin-dependent kinase 2
Synonyms:
CDK2 CDK2_HUMAN Cell division protein kinase 2 Protein cereblon/Cyclin-dependent kinase 2 | p33 protein kinase
Type:
Enzyme Subunit
Mol. Mass.:
33938.17
Organism:
Homo sapiens (Human)
Description:
P24941
Residue:
298
  
Inhibitor
Name:
BDBM50263146
Synonyms:
5-fluoro-4-(1-isopropyl-2-methyl-1H-imidazol-5-yl)-N-(4-morpholinophenyl)pyrimidin-2-amine | CHEMBL515001
Type:
Small organic molecule
Emp. Form.:
C21H25FN6O
Mol. Mass.:
396.4612
SMILES:
CC(C)n1c(C)ncc1-c1nc(Nc2ccc(cc2)N2CCOCC2)ncc1F
: