Target
Bone morphogenetic protein 4
Ligand
BDBM50261927
Substrate
Meas. Tech.
ChEMBL_490878 (CHEMBL989154)
IC50
>20000±n/a nM
Citation
 Cuny, GDYu, PBLaha, JKXing, XLiu, JFLai, CSDeng, DYSachidanandan, CBloch, KDPeterson, RT Structure-activity relationship study of bone morphogenetic protein (BMP) signaling inhibitors. Bioorg Med Chem Lett 18:4388-92 (2008)  
Target
Name:
Bone morphogenetic protein 4
Synonyms:
BMP2B BMP4_HUMAN | DVR4
Type:
PROTEIN
Mol. Mass.:
46572.96
Organism:
Homo sapiens (Human)
Description:
ChEMBL_1363193
Residue:
408
  
Inhibitor
Name:
BDBM50261927
Synonyms:
3-phenyl-6-(4-(2-(piperidin-1-yl)ethoxy)phenyl)pyrazolo[1,5-a]pyrimidine | CHEMBL467997
Type:
Small organic molecule
Emp. Form.:
C25H26N4O
Mol. Mass.:
398.5001
SMILES:
C(CN1CCCCC1)Oc1ccc(cc1)-c1cnc2c(cnn2c1)-c1ccccc1
: