Target
B1 bradykinin receptor
Ligand
BDBM50264723
Substrate
Meas. Tech.
ChEMBL_492574 (CHEMBL952241)
Ki
1±n/a nM
Citation
 Kuduk, SDChang, RKDipardo, RMDi Marco, CNMurphy, KLRansom, RWReiss, DRTang, CPrueksaritanont, TPettibone, DJBock, MG Bradykinin B1 receptor antagonists: an alpha-hydroxy amide with an improved metabolism profile. Bioorg Med Chem Lett 18:5107-10 (2008)  
Target
Name:
B1 bradykinin receptor
Synonyms:
B1 BRADYKININ B1R BK-1 receptor BRADYB1 | Bradykinin B1 receptor
Type:
Enzyme
Mol. Mass.:
40508.87
Organism:
Homo sapiens (Human)
Description:
P46663
Residue:
353
  
Inhibitor
Name:
BDBM50264723
Synonyms:
CHEMBL484882 | N-(1-(5-(5-chloro-3-fluoro-2-(2-methyl-2H-tetrazol-5-yl)phenyl)-3-fluoropyridin-2-yl)ethyl)-3,3-difluoro-1-hydroxycyclopentanecarboxamide
Type:
Small organic molecule
Emp. Form.:
C21H19ClF4N6O2
Mol. Mass.:
498.861
SMILES:
CC(NC(=O)C1(O)CCC(F)(F)C1)c1ncc(cc1F)-c1cc(Cl)cc(F)c1-c1nnn(C)n1
: