Target
Adenosine receptor A1
Ligand
BDBM50253852
Substrate
Meas. Tech.
ChEMBL_511508 (CHEMBL978239)
Kd
1.7±n/a nM
Citation
 Romagnoli, RBaraldi, PGCarrion, MDCara, CLCruz-Lopez, OIaconinoto, MAPreti, DShryock, JCMoorman, ARVincenzi, FVarani, KAndrea Borea, P Synthesis and biological evaluation of 2-amino-3-(4-chlorobenzoyl)-4-[N-(substituted) piperazin-1-yl]thiophenes as potent allosteric enhancers of the A1 adenosine receptor. J Med Chem 51:5875-9 (2008)  
Target
Name:
Adenosine receptor A1
Synonyms:
A1 adenosine receptor (hA1) AA1R_HUMAN ADORA1 Adenosine A1-receptor Adenosine receptor A1 (hA1) | Adenosine transporter (AdT)
Type:
G Protein-Coupled Receptor (GPCR)
Mol. Mass.:
36520.92
Organism:
Homo sapiens (Human)
Description:
P30542
Residue:
326
  
Inhibitor
Name:
BDBM50253852
Synonyms:
(2-amino-4-((4-methylpiperazin-1-yl)methyl)thiophen-3-yl)(4-chlorophenyl)methanone | CHEMBL510840
Type:
Small organic molecule
Emp. Form.:
C17H20ClN3OS
Mol. Mass.:
349.878
SMILES:
CN1CCN(Cc2csc(N)c2C(=O)c2ccc(Cl)cc2)CC1
: