Target
Adenosine receptor A1
Ligand
BDBM50264169
Substrate
Meas. Tech.
ChEMBL_535299 (CHEMBL982624)
Ki
3000±n/a nM
Citation
 Melman, AWang, BJoshi, BVGao, ZGCastro, SHeller, CLKim, SKJeong, LSJacobson, KA Selective A(3) adenosine receptor antagonists derived from nucleosides containing a bicyclo[3.1.0]hexane ring system. Bioorg Med Chem 16:8546-56 (2008)  
Target
Name:
Adenosine receptor A1
Synonyms:
A1 adenosine receptor (hA1) AA1R_HUMAN ADORA1 Adenosine A1-receptor Adenosine receptor A1 (hA1) | Adenosine transporter (AdT)
Type:
G Protein-Coupled Receptor (GPCR)
Mol. Mass.:
36520.92
Organism:
Homo sapiens (Human)
Description:
P30542
Residue:
326
  
Inhibitor
Name:
BDBM50264169
Synonyms:
(1'R,2'R,3'S,4'R,5'S)-4'-[2-Chloro-6-(2,5-dimethoxybenzylamino)-purine]-2',3'-O-dihydroxybicyclo-[3.1.0]hexane | CHEMBL490405
Type:
Small organic molecule
Emp. Form.:
C20H22ClN5O4
Mol. Mass.:
431.873
SMILES:
COc1ccc(OC)c(CNc2nc(Cl)nc3n(cnc23)[C@@H]2[C@H]3C[C@H]3[C@@H](O)[C@H]2O)c1
: