Target
Estrogen receptor
Ligand
BDBM50253387
Substrate
Meas. Tech.
ChEMBL_539657 (CHEMBL1028192)
Ki
>1000000±n/a nM
Citation
 Parent, AAGunther, JRKatzenellenbogen, JA Blocking estrogen signaling after the hormone: pyrimidine-core inhibitors of estrogen receptor-coactivator binding. J Med Chem 51:6512-30 (2008)  
Target
Name:
Estrogen receptor
Synonyms:
ER ESR ESR1_HUMAN Estrogen receptor Estrogen receptor (ER-alpha) Estrogen receptor alpha (ER) Nuclear receptor subfamily 3 group A member 1
Type:
Protein
Mol. Mass.:
66230.44
Organism:
Homo sapiens (Human)
Description:
P03372
Residue:
595
  
Inhibitor
Name:
BDBM50253387
Synonyms:
CHEMBL492665 | N2,N4-dimethyl-N2,N4-diisobutyl-(6-styryl-pyrimidin-2,4-yl)-diamine
Type:
Small organic molecule
Emp. Form.:
C22H32N4
Mol. Mass.:
352.5163
SMILES:
CC(C)CN(C)c1cc(\C=C\c2ccccc2)nc(n1)N(C)CC(C)C
: