Target
D(1A) dopamine receptor
Ligand
BDBM50253395
Substrate
Meas. Tech.
ChEMBL_539670 (CHEMBL1028978)
Ki
13000±n/a nM
Citation
 Chen, JCollins, GTZhang, JYang, CYLevant, BWoods, JWang, S Design, synthesis, and evaluation of potent and selective ligands for the dopamine 3 (D3) receptor with a novel in vivo behavioral profile. J Med Chem 51:5905-8 (2008)  
Target
Name:
D(1A) dopamine receptor
Synonyms:
DOPAMINE D1 Dopamine D1 high Dopamine receptor Dopamine1-like Drd1a
Type:
Enzyme Catalytic Domain
Mol. Mass.:
49429.75
Organism:
RAT
Description:
P18901
Residue:
446
  
Inhibitor
Name:
BDBM50253395
Synonyms:
CHEMBL494309 | Naphthalene-2-carboxylic acid (4-{2-[((S)-2-amino-4,5,6,7-tetrahydro-benzothiazol-6-yl)-(3-methyl-butyl)-amino]-ethyl}-cyclohexyl)-amide
Type:
Small organic molecule
Emp. Form.:
C31H42N4OS
Mol. Mass.:
518.756
SMILES:
CC(C)CCN(CC[C@H]1CC[C@@H](CC1)NC(=O)c1ccc2ccccc2c1)[C@H]1CCc2nc(N)sc2C1
: