Target
Acetylcholinesterase
Ligand
BDBM50265193
Substrate
Meas. Tech.
ChEMBL_497074 (CHEMBL997710)
Ki
1908±n/a nM
Citation
 Butini, SGuarino, ECampiani, GBrindisi, MCoccone, SSFiorini, INovellino, EBelinskaya, TSaxena, AGemma, S Tacrine based human cholinesterase inhibitors: synthesis of peptidic-tethered derivatives and their effect on potency and selectivity. Bioorg Med Chem Lett 18:5213-6 (2008)  
Target
Name:
Acetylcholinesterase
Synonyms:
ACES_HUMAN Acetylcholinesterase (AChE) | Acetylcholinesterase (human AChE)
Type:
Enzyme
Mol. Mass.:
67792.70
Organism:
Homo sapiens (Human)
Description:
P22303
Residue:
614
  
Inhibitor
Name:
BDBM50265193
Synonyms:
(S)-2-amino-N-(2-oxo-2-(1,2,3,4-tetrahydroacridin-9-ylamino)ethyl)-3-phenylpropanamide | CHEMBL495711
Type:
Small organic molecule
Emp. Form.:
C24H26N4O2
Mol. Mass.:
402.4888
SMILES:
N[C@@H](Cc1ccccc1)C(=O)NCC(=O)Nc1c2CCCCc2nc2ccccc12
: