Target
Matrix metalloproteinase-14
Ligand
BDBM50264811
Substrate
Meas. Tech.
ChEMBL_497410 (CHEMBL1002951)
Ki
680±n/a nM
Citation
 Georgiadis, DYiotakis, A Specific targeting of metzincin family members with small-molecule inhibitors: progress toward a multifarious challenge. Bioorg Med Chem 16:8781-94 (2008)  
Target
Name:
Matrix metalloproteinase-14
Synonyms:
MMP-14 MMP14 MT-MMP 1 MT1MMP Matrix Metalloproteinase-14 (MMP-14) Matrix metalloproteinase-14 Membrane-type matrix metalloproteinase 1 | Membrane-type-1 matrix metalloproteinase
Type:
Protein
Mol. Mass.:
65900.19
Organism:
Homo sapiens (Human)
Description:
P50281
Residue:
582
  
Inhibitor
Name:
BDBM50264811
Synonyms:
CHEMBL485492 US10357546, ND-364
Type:
Small organic molecule
Emp. Form.:
C17H17NO4S2
Mol. Mass.:
363.451
SMILES:
CC(=O)Nc1ccc(Oc2ccc(cc2)S(=O)(=O)CC2CS2)cc1
: