Target
Disintegrin and metalloproteinase domain-containing protein 17
Ligand
BDBM26554
Substrate
Meas. Tech.
ChEMBL_497412 (CHEMBL1002953)
Ki
10±n/a nM
Citation
 Georgiadis, DYiotakis, A Specific targeting of metzincin family members with small-molecule inhibitors: progress toward a multifarious challenge. Bioorg Med Chem 16:8781-94 (2008)  
Target
Name:
Disintegrin and metalloproteinase domain-containing protein 17
Synonyms:
ADA17_HUMAN CSVP Disintegrin and metalloproteinase domain-containing protein 17 (ADAM17) TNF-alpha convertase TNF-alpha-converting enzyme (TACE) Tumor necrosis factor-α converting enzyme (TACE)
Type:
Enzyme
Mol. Mass.:
93007.89
Organism:
Homo sapiens (Human)
Description:
Residue:
824
  
Inhibitor
Name:
BDBM26554
Synonyms:
3-{[4-(but-2-yn-1-yloxy)benzene]sulfonyl}propane-1-thiol thiol-aryl sulfone, 8b
Type:
Small organic molecule
Emp. Form.:
C13H16O3S2
Mol. Mass.:
284.394
SMILES:
CC#CCOc1ccc(cc1)S(=O)(=O)CCCS
: