Target
Inosine-5'-monophosphate dehydrogenase 2
Ligand
BDBM50275685
Substrate
Meas. Tech.
ChEMBL_496848 (CHEMBL998517)
Ki
2300±n/a nM
Citation
 Chen, LWilson, DJLabello, NPJayaram, HNPankiewicz, KW Mycophenolic acid analogs with a modified metabolic profile. Bioorg Med Chem 16:9340-5 (2008)  
Target
Name:
Inosine-5'-monophosphate dehydrogenase 2
Synonyms:
IMDH2_HUMAN IMPD 2 IMPDH-II Inosine 5'-monophosphate dehydrogenase II (IMPDH II) Inosine-5 -monophosphate dehydrogenase 2 | Inosine-5'-monophosphate dehydrogenase (IMPDH)
Type:
Enzyme
Mol. Mass.:
55806.87
Organism:
Homo sapiens (Human)
Description:
Recombinant IMPDH2 expressed in E. coli.
Residue:
514
  
Inhibitor
Name:
BDBM50275685
Synonyms:
(E)-6-(2,4-dimethoxy-5-(oxazol-5-yl)phenyl)-4-methylhex-4-enoic acid CHEMBL443417
Type:
Small organic molecule
Emp. Form.:
C18H21NO5
Mol. Mass.:
331.363
SMILES:
COc1cc(OC)c(cc1C\C=C(/C)CCC(O)=O)-c1cnco1
: