Target
Cyclin-dependent kinase 2
Ligand
BDBM50025069
Substrate
Meas. Tech.
ChEMBL_536407 (CHEMBL992478)
IC50
<3±n/a nM
Citation
 Anderson, MAndrews, DMBarker, AJBrassington, CABreed, JByth, KFCulshaw, JDFinlay, MRFisher, EMcMiken, HHGreen, CPHeaton, DWNash, IANewcombe, NJOakes, SEPauptit, RARoberts, AStanway, JJThomas, APTucker, JAWalker, MWeir, HM Imidazoles: SAR and development of a potent class of cyclin-dependent kinase inhibitors. Bioorg Med Chem Lett 18:5487-92 (2008)  
Target
Name:
Cyclin-dependent kinase 2
Synonyms:
CDK2 CDK2_HUMAN Cell division protein kinase 2 Protein cereblon/Cyclin-dependent kinase 2 | p33 protein kinase
Type:
Enzyme Subunit
Mol. Mass.:
33938.17
Organism:
Homo sapiens (Human)
Description:
P24941
Residue:
298
  
Inhibitor
Name:
BDBM50025069
Synonyms:
CHEMBL485425
Type:
Small organic molecule
Emp. Form.:
C16H18N6O2S
Mol. Mass.:
358.418
SMILES:
CNS(=O)(=O)c1ccc(Nc2nccc(n2)-c2cnc(C)n2C)cc1
: