Target
Cyclin-dependent kinase 2
Ligand
BDBM50274625
Substrate
Meas. Tech.
ChEMBL_536407 (CHEMBL992478)
IC50
8±n/a nM
Citation
 Anderson, MAndrews, DMBarker, AJBrassington, CABreed, JByth, KFCulshaw, JDFinlay, MRFisher, EMcMiken, HHGreen, CPHeaton, DWNash, IANewcombe, NJOakes, SEPauptit, RARoberts, AStanway, JJThomas, APTucker, JAWalker, MWeir, HM Imidazoles: SAR and development of a potent class of cyclin-dependent kinase inhibitors. Bioorg Med Chem Lett 18:5487-92 (2008)  
Target
Name:
Cyclin-dependent kinase 2
Synonyms:
CDK2 CDK2_HUMAN Cell division protein kinase 2 Protein cereblon/Cyclin-dependent kinase 2 | p33 protein kinase
Type:
Enzyme Subunit
Mol. Mass.:
33938.17
Organism:
Homo sapiens (Human)
Description:
P24941
Residue:
298
  
Inhibitor
Name:
BDBM50274625
Synonyms:
4-(1-isopropyl-2-methyl-1H-imidazol-5-yl)-N-(4-(propylsulfonyl)phenyl)pyrimidin-2-amine | CHEMBL485240
Type:
Small organic molecule
Emp. Form.:
C20H25N5O2S
Mol. Mass.:
399.51
SMILES:
CCCS(=O)(=O)c1ccc(Nc2nccc(n2)-c2cnc(C)n2C(C)C)cc1
: