Target
Small conductance calcium-activated potassium channel protein 3
Ligand
BDBM50275960
Substrate
Meas. Tech.
ChEMBL_497517 (CHEMBL995892)
IC50
350±n/a nM
Citation
 Gentles, RGHu, SHuang, YGrant-Young, KPoss, MAAndres, CFiedler, TKnox, RLodge, NWeaver, CDHarden, DG Preliminary SAR studies on non-apamin-displacing 4-(aminomethylaryl)pyrrazolopyrimidine K(Ca) channel blockers. Bioorg Med Chem Lett 18:5694-7 (2008)  
Target
Name:
Small conductance calcium-activated potassium channel protein 3
Synonyms:
K3 KCNN3_HUMAN Small conductance calcium-activated potassium channel protein 3 (KCa2.3)
Type:
Protein
Mol. Mass.:
82053.75
Organism:
Homo sapiens (Human)
Description:
Q9UGI6
Residue:
731
  
Inhibitor
Name:
BDBM50275960
Synonyms:
5-chloro-N-(thiophen-2-ylmethyl)pyrazolo[1,5-a]pyrimidin-7-amine | CHEMBL472452
Type:
Small organic molecule
Emp. Form.:
C11H9ClN4S
Mol. Mass.:
264.734
SMILES:
Clc1cc(NCc2cccs2)n2nccc2n1
: