Target
Muscarinic acetylcholine receptor M2
Ligand
BDBM50275559
Substrate
Meas. Tech.
ChEMBL_492756 (CHEMBL939444)
EC50
>30000±n/a nM
Citation
 Miller, NRDaniels, RNBridges, TMBrady, AEConn, PJLindsley, CW Synthesis and SAR of analogs of the M1 allosteric agonist TBPB. Part II: Amides, sulfonamides and ureas--the effect of capping the distal basic piperidine nitrogen. Bioorg Med Chem Lett 18:5443-7 (2008)  
Target
Name:
Muscarinic acetylcholine receptor M2
Synonyms:
ACM2_HUMAN Cholinergic, muscarinic M2 Muscarinic acetylcholine receptor M2 and M5 | RecName: Full=Muscarinic acetylcholine receptor M2
Type:
GPCR
Mol. Mass.:
51730.61
Organism:
Homo sapiens (Human)
Description:
P08172
Residue:
466
  
Inhibitor
Name:
BDBM50275559
Synonyms:
4-(6-fluoro-2-oxo-2,3-dihydro-1H-benzo[d]imidazol-1-yl)-N-(3-(trifluoromethylthio)phenyl)-1,4'-bipiperidine-1'-carboxamide | CHEMBL487985
Type:
Small organic molecule
Emp. Form.:
C25H27F4N5O2S
Mol. Mass.:
537.573
SMILES:
Fc1ccc2[nH]c(=O)n(C3CCN(CC3)C3CCN(CC3)C(=O)Nc3cccc(SC(F)(F)F)c3)c2c1
: