Target
cAMP-specific 3',5'-cyclic phosphodiesterase 4A
Ligand
BDBM50274028
Substrate
Meas. Tech.
ChEMBL_536739 (CHEMBL984533)
IC50
0.06±n/a nM
Citation
 Guay, DBoulet, LFriesen, RWGirard, MHamel, PHuang, ZLaliberté, FLaliberté, SMancini, JAMuise, EPon, DStyhler, A Optimization and structure-activity relationship of a series of 1-phenyl-1,8-naphthyridin-4-one-3-carboxamides: identification of MK-0873, a potent and effective PDE4 inhibitor. Bioorg Med Chem Lett 18:5554-8 (2008)  
Target
Name:
cAMP-specific 3',5'-cyclic phosphodiesterase 4A
Synonyms:
3',5'-cyclic phosphodiesterase PDE46 PDE4A_HUMAN Phosphodiesterase 4A | Phosphodiesterase 4A (PDE4)
Type:
Enzyme
Mol. Mass.:
98113.27
Organism:
Homo sapiens (Human)
Description:
P27815
Residue:
886
  
Inhibitor
Name:
BDBM50274028
Synonyms:
CHEMBL499477 | N-(3,5-dichloropyridin-4-yl)-1-(3-(2-(3-methyl-1,2,4-oxadiazol-5-yl)-2-(4-(methylsulfonyl)phenyl)vinyl)phenyl)-4-oxo-1,4-dihydro-1,8-naphthyridine-3-carboxamide
Type:
Small organic molecule
Emp. Form.:
C32H22Cl2N6O5S
Mol. Mass.:
673.525
SMILES:
Cc1noc(n1)C(=C\c1cccc(c1)-n1cc(C(=O)Nc2c(Cl)cncc2Cl)c(=O)c2cccnc12)\c1ccc(cc1)S(C)(=O)=O
: