Target
Plasmepsin II
Ligand
BDBM50273730
Substrate
Meas. Tech.
ChEMBL_536036 (CHEMBL991606)
Ki
10±n/a nM
Citation
 Hidaka, KKimura, TRuben, AJUemura, TKamiya, MKiso, AOkamoto, TTsuchiya, YHayashi, YFreire, EKiso, Y Antimalarial activity enhancement in hydroxymethylcarbonyl (HMC) isostere-based dipeptidomimetics targeting malarial aspartic protease plasmepsin. Bioorg Med Chem 16:10049-60 (2008)  
Target
Name:
Plasmepsin II
Synonyms:
Aspartic hemoglobinase II PLM2_PLAFX Plasmepsin 2 Plasmepsin-II
Type:
Enzyme
Mol. Mass.:
51482.09
Organism:
Plasmodium falciparum
Description:
P46925
Residue:
453
  
Inhibitor
Name:
BDBM50273730
Synonyms:
(R)-N-[(1S,2R)-2-Hydroxyindan-1-yl]-3-[(2S,3S)-3-(4-hydroxymethylphenoxyacetyl)amino-2-hydroxy-4-phenylbutanoyl]-5,5-dimethyl-1,3-thiazolidine-4-carboxamide KNI-10125
Type:
Small organic molecule
Emp. Form.:
C34H39N3O7S
Mol. Mass.:
633.754
SMILES:
CC1(C)SCN([C@@H]1C(=O)N[C@@H]1[C@H](O)Cc2ccccc12)C(=O)[C@@H](O)[C@H](Cc1ccccc1)NC(=O)COc1ccc(CO)cc1
: