Target
Amine oxidase [flavin-containing] A
Ligand
BDBM50245813
Substrate
Meas. Tech.
ChEMBL_558907 (CHEMBL1022586)
IC50
20050±n/a nM
Citation
 Jayaprakash, VSinha, BNUcar, GErcan, A Pyrazoline-based mycobactin analogues as MAO-inhibitors. Bioorg Med Chem Lett 18:6362-8 (2008)  
Target
Name:
Amine oxidase [flavin-containing] A
Synonyms:
AOFA_RAT Amine oxidase [flavin-containing] A Monoamine Oxidase Type A (MAO-A) Monoamine oxidase A (MAO-A) Monoamine oxidase type A (MAOA)
Type:
Enzyme
Mol. Mass.:
59515.21
Organism:
Rattus norvegicus (rat)
Description:
Residue:
526
  
Inhibitor
Name:
BDBM50245813
Synonyms:
5-(2-chlorophenyl)-3-(2-hydroxyphenyl)-N-phenyl-4,5-dihydro-1H-pyrazole-1-carbothioamide | CHEMBL452092
Type:
Small organic molecule
Emp. Form.:
C22H18ClN3OS
Mol. Mass.:
407.916
SMILES:
Oc1ccccc1C1=NN(C(C1)c1ccccc1Cl)C(=S)Nc1ccccc1
: