Target
Amine oxidase [flavin-containing] A
Ligand
BDBM50245815
Substrate
Meas. Tech.
ChEMBL_558907 (CHEMBL1022586)
IC50
58100±n/a nM
Citation
 Jayaprakash, VSinha, BNUcar, GErcan, A Pyrazoline-based mycobactin analogues as MAO-inhibitors. Bioorg Med Chem Lett 18:6362-8 (2008)  
Target
Name:
Amine oxidase [flavin-containing] A
Synonyms:
AOFA_RAT Amine oxidase [flavin-containing] A Monoamine Oxidase Type A (MAO-A) Monoamine oxidase A (MAO-A) Monoamine oxidase type A (MAOA)
Type:
Enzyme
Mol. Mass.:
59515.21
Organism:
Rattus norvegicus (rat)
Description:
Residue:
526
  
Inhibitor
Name:
BDBM50245815
Synonyms:
3,5-bis(2-hydroxyphenyl)-N-phenyl-4,5-dihydro-1H-pyrazole-1-carbothioamide | CHEMBL508880
Type:
Small organic molecule
Emp. Form.:
C22H19N3O2S
Mol. Mass.:
389.47
SMILES:
Oc1ccccc1C1CC(=NN1C(=S)Nc1ccccc1)c1ccccc1O
: