Target
Hydroxycarboxylic acid receptor 2
Ligand
BDBM50241028
Substrate
Meas. Tech.
ChEMBL_536823 (CHEMBL988087)
EC50
400±n/a nM
Citation
 Boatman, PDRichman, JGSemple, G Nicotinic acid receptor agonists. J Med Chem 51:7653-62 (2008)  
Target
Name:
Hydroxycarboxylic acid receptor 2
Synonyms:
G-protein coupled receptor 109A GPR109A HCAR2 HM74A NIACR1 Nicotinic acid receptor 1
Type:
G Protein-Coupled Receptor (GPCR)
Mol. Mass.:
41868.22
Organism:
Homo sapiens (Human)
Description:
Membranes from CHO cells expressing the recombinant human GPR109A were used in competition binding assay.
Residue:
363
  
Inhibitor
Name:
BDBM50241028
Synonyms:
1-Isopropyl-1H-benzotriazole-5-carboxylic acid CHEMBL381638
Type:
Small organic molecule
Emp. Form.:
C10H11N3O2
Mol. Mass.:
205.2132
SMILES:
CC(C)n1nnc2cc(ccc12)C(O)=O
: