Target
Cyclin-dependent kinase 2
Ligand
BDBM50246349
Substrate
Meas. Tech.
ChEMBL_558912 (CHEMBL1022591)
IC50
3±n/a nM
Citation
 Jones, CDAndrews, DMBarker, AJBlades, KByth, KFFinlay, MRGeh, CGreen, CPJohannsen, MWalker, MWeir, HM Imidazole pyrimidine amides as potent, orally bioavailable cyclin-dependent kinase inhibitors. Bioorg Med Chem Lett 18:6486-9 (2008)  
Target
Name:
Cyclin-dependent kinase 2
Synonyms:
CDK2 CDK2_HUMAN Cell division protein kinase 2 Protein cereblon/Cyclin-dependent kinase 2 | p33 protein kinase
Type:
Enzyme Subunit
Mol. Mass.:
33938.17
Organism:
Homo sapiens (Human)
Description:
P24941
Residue:
298
  
Inhibitor
Name:
BDBM50246349
Synonyms:
4-(5-fluoro-4-(1-isopropyl-2-methyl-1H-imidazol-5-yl)pyrimidin-2-ylamino)-N-methylbenzamide | CHEMBL453655
Type:
Small organic molecule
Emp. Form.:
C19H21FN6O
Mol. Mass.:
368.408
SMILES:
CNC(=O)c1ccc(Nc2ncc(F)c(n2)-c2cnc(C)n2C(C)C)cc1
: