Target
Activated CDC42 kinase 1
Ligand
BDBM50246261
Substrate
Meas. Tech.
ChEMBL_559411 (CHEMBL1017265)
Ki
5±n/a nM
Citation
 Kopecky, DJHao, XChen, YFu, JJiao, XJaen, JCCardozo, MGLiu, JWang, ZWalker, NPWesche, HLi, SFarrelly, EXiao, SHKayser, F Identification and optimization of N3,N6-diaryl-1H-pyrazolo[3,4-d]pyrimidine-3,6-diamines as a novel class of ACK1 inhibitors. Bioorg Med Chem Lett 18:6352-6 (2008)  
Target
Name:
Activated CDC42 kinase 1
Synonyms:
ACK1 Activated CDC42 kinase 1 (ACK-1) Tyrosine kinase non-receptor protein 2
Type:
Protein
Mol. Mass.:
114577.86
Organism:
Homo sapiens (Human)
Description:
Q07912
Residue:
1038
  
Inhibitor
Name:
BDBM50246261
Synonyms:
CHEMBL487054 | N3-(2,6-dichlorophenyl)-1-(3-(dimethylamino)propyl)-N6-phenyl-1H-pyrazolo[3,4-d]pyrimidine-3,6-diamine
Type:
Small organic molecule
Emp. Form.:
C22H23Cl2N7
Mol. Mass.:
456.371
SMILES:
CN(C)CCCn1nc(Nc2c(Cl)cccc2Cl)c2cnc(Nc3ccccc3)nc12
: