Target
Cyclin-dependent kinase 2
Ligand
BDBM50246406
Substrate
Meas. Tech.
ChEMBL_559442 (CHEMBL1018123)
IC50
1±n/a nM
Citation
 Jones, CDAndrews, DMBarker, AJBlades, KDaunt, PEast, SGeh, CGraham, MAJohnson, KMLoddick, SAMcFarland, HMMcGregor, AMoss, LRudge, DASimpson, PBSwain, MLTam, KYTucker, JAWalker, M The discovery of AZD5597, a potent imidazole pyrimidine amide CDK inhibitor suitable for intravenous dosing. Bioorg Med Chem Lett 18:6369-73 (2008)  
Target
Name:
Cyclin-dependent kinase 2
Synonyms:
CDK2 CDK2_HUMAN Cell division protein kinase 2 Protein cereblon/Cyclin-dependent kinase 2 | p33 protein kinase
Type:
Enzyme Subunit
Mol. Mass.:
33938.17
Organism:
Homo sapiens (Human)
Description:
P24941
Residue:
298
  
Inhibitor
Name:
BDBM50246406
Synonyms:
2-fluoro-4-(5-fluoro-4-(1-isopropyl-2-methyl-1H-imidazol-5-yl)pyrimidin-2-ylamino)-N-(1-methylpiperidin-4-yl)benzamide | CHEMBL509406
Type:
Small organic molecule
Emp. Form.:
C24H29F2N7O
Mol. Mass.:
469.5302
SMILES:
CC(C)n1c(C)ncc1-c1nc(Nc2ccc(C(=O)NC3CCN(C)CC3)c(F)c2)ncc1F
: