Target
Cyclin-dependent kinase 2
Ligand
BDBM50245864
Substrate
Meas. Tech.
ChEMBL_559442 (CHEMBL1018123)
IC50
2±n/a nM
Citation
 Jones, CDAndrews, DMBarker, AJBlades, KDaunt, PEast, SGeh, CGraham, MAJohnson, KMLoddick, SAMcFarland, HMMcGregor, AMoss, LRudge, DASimpson, PBSwain, MLTam, KYTucker, JAWalker, M The discovery of AZD5597, a potent imidazole pyrimidine amide CDK inhibitor suitable for intravenous dosing. Bioorg Med Chem Lett 18:6369-73 (2008)  
Target
Name:
Cyclin-dependent kinase 2
Synonyms:
CDK2 CDK2_HUMAN Cell division protein kinase 2 Protein cereblon/Cyclin-dependent kinase 2 | p33 protein kinase
Type:
Enzyme Subunit
Mol. Mass.:
33938.17
Organism:
Homo sapiens (Human)
Description:
P24941
Residue:
298
  
Inhibitor
Name:
BDBM50245864
Synonyms:
CHEMBL462385 | N-(2-(dimethylamino)ethyl)-2-fluoro-4-(5-fluoro-4-(1-isopropyl-2-methyl-1H-imidazol-5-yl)pyrimidin-2-ylamino)benzamide
Type:
Small organic molecule
Emp. Form.:
C22H27F2N7O
Mol. Mass.:
443.4929
SMILES:
CC(C)n1c(C)ncc1-c1nc(Nc2ccc(C(=O)NCCN(C)C)c(F)c2)ncc1F
: