Target
Adenosine receptor A3
Ligand
BDBM50170140
Substrate
Meas. Tech.
ChEMBL_559972 (CHEMBL1014571)
Ki
23±n/a nM
Citation
 Baraldi, PGPreti, DTabrizi, MARomagnoli, RSaponaro, GBaraldi, SBotta, MBernardini, CTafi, ATuccinardi, TMartinelli, AVarani, KBorea, PA Structure-activity relationship studies of a new series of imidazo[2,1-f]purinones as potent and selective A(3) adenosine receptor antagonists. Bioorg Med Chem 16:10281-94 (2008)  
Target
Name:
Adenosine receptor A3
Synonyms:
A3 adenosine receptor (hA3) ADORA3 | Adenosine A3 receptor (A3AR)
Type:
G Protein-Coupled Receptor (GPCR)
Mol. Mass.:
36197.32
Organism:
Homo sapiens (Human)
Description:
P0DMS8
Residue:
318
  
Inhibitor
Name:
BDBM50170140
Synonyms:
1-Benzyl-7-cyclopropyl-3-propyl-1H,8H-imidazo[2,1-f]purine-2,4-dione CHEMBL364036
Type:
Small organic molecule
Emp. Form.:
C20H21N5O2
Mol. Mass.:
363.413
SMILES:
CCCn1c(=O)n(Cc2ccccc2)c2nc3[nH]c(cn3c2c1=O)C1CC1
: