Target
Adenosine receptor A3
Ligand
BDBM50170136
Substrate
Meas. Tech.
ChEMBL_559972 (CHEMBL1014571)
Ki
3.45±n/a nM
Citation
 Baraldi, PGPreti, DTabrizi, MARomagnoli, RSaponaro, GBaraldi, SBotta, MBernardini, CTafi, ATuccinardi, TMartinelli, AVarani, KBorea, PA Structure-activity relationship studies of a new series of imidazo[2,1-f]purinones as potent and selective A(3) adenosine receptor antagonists. Bioorg Med Chem 16:10281-94 (2008)  
Target
Name:
Adenosine receptor A3
Synonyms:
A3 adenosine receptor (hA3) ADORA3 | Adenosine A3 receptor (A3AR)
Type:
G Protein-Coupled Receptor (GPCR)
Mol. Mass.:
36197.32
Organism:
Homo sapiens (Human)
Description:
P0DMS8
Residue:
318
  
Inhibitor
Name:
BDBM50170136
Synonyms:
1-Benzyl-7-ethyl-3-propyl-1H,6H-pyrrolo[2,1-f]purine-2,4-dione CHEMBL371404
Type:
Small organic molecule
Emp. Form.:
C20H22N4O2
Mol. Mass.:
350.4143
SMILES:
CCCn1c(=O)n(Cc2ccccc2)c2nc3C=C(CC)Cn3c2c1=O
: