Target
Coagulation factor X
Ligand
BDBM50265977
Substrate
Meas. Tech.
ChEMBL_544730 (CHEMBL1010168)
Ki
0.06±n/a nM
Citation
 Qiao, JXKing, SRHe, KWong, PCRendina, ARLuettgen, JMXin, BKnabb, RMWexler, RRLam, PY Highly efficacious factor Xa inhibitors containing alpha-substituted phenylcycloalkyl P4 moieties. Bioorg Med Chem Lett 19:462-8 (2008)  
Target
Name:
Coagulation factor X
Synonyms:
Activated coagulation factor X (FXa) Coagulation factor X precursor F10 Factor X heavy chain Factor Xa Stuart-Prower factor
Type:
Enzyme
Mol. Mass.:
54726.60
Organism:
Homo sapiens (Human)
Description:
Residue:
488
  
Inhibitor
Name:
BDBM50265977
Synonyms:
1-(4-methoxyphenyl)-6-(4-(1-((methylamino)methyl)cyclopropyl)phenyl)-7-oxo-4,5,6,7-tetrahydro-1H-pyrazolo[3,4-c]pyridine-3-carboxamide | CHEMBL468792
Type:
Small organic molecule
Emp. Form.:
C25H27N5O3
Mol. Mass.:
445.5136
SMILES:
CNCC1(CC1)c1ccc(cc1)N1CCc2c(nn(c2C1=O)-c1ccc(OC)cc1)C(N)=O
: