Target
Sodium-dependent dopamine transporter
Ligand
BDBM50273640
Substrate
Meas. Tech.
ChEMBL_560914 (CHEMBL1013549)
IC50
2.5±n/a nM
Citation
 Jin, CNavarro, HACarroll, FI Development of 3-phenyltropane analogues with high affinity for the dopamine and serotonin transporters and low affinity for the norepinephrine transporter. J Med Chem 51:8048-56 (2008)  
Target
Name:
Sodium-dependent dopamine transporter
Synonyms:
DA transporter DAT1 Dopamine transporter protein (DAT) SC6A3_HUMAN Sodium-dependent dopamine transporter Solute carrier family 6 member 3
Type:
Multi-pass membrane protein
Mol. Mass.:
68497.11
Organism:
Homo sapiens (Human)
Description:
Q01959
Residue:
620
  
Inhibitor
Name:
BDBM50273640
Synonyms:
(1R,2S,3S,5R)-4-amino-3-iodophenethyl 3-(4-methoxyphenyl)-8-methyl-8-aza-bicyclo[3.2.1]octane-2-carboxylate hydrochloride | CHEMBL459332
Type:
Small organic molecule
Emp. Form.:
C24H29IN2O3
Mol. Mass.:
520.4031
SMILES:
COc1ccc(cc1)[C@H]1C[C@H]2CC[C@H]([C@H]1C(=O)OCCc1ccc(N)c(I)c1)N2C
: