Target
Arylamine N-acetyltransferase 2
Ligand
BDBM50274893
Substrate
Meas. Tech.
ChEMBL_494097 (CHEMBL942269)
IC50
>30000±n/a nM
Citation
 Russell, AJWestwood, IMCrawford, MHRobinson, JKawamura, ARedfield, CLaurieri, NLowe, EDDavies, SGSim, E Selective small molecule inhibitors of the potential breast cancer marker, human arylamine N-acetyltransferase 1, and its murine homologue, mouse arylamine N-acetyltransferase 2. Bioorg Med Chem 17:905-18 (2009)  
Target
Name:
Arylamine N-acetyltransferase 2
Synonyms:
ARY2_MOUSE Nat2
Type:
PROTEIN
Mol. Mass.:
33697.98
Organism:
Mus musculus
Description:
ChEMBL_1347887
Residue:
290
  
Inhibitor
Name:
BDBM50274893
Synonyms:
(Z)-5-(Naphthalen-2'-ylmethylene)thiazolidine-2,4-dione | CHEMBL457715
Type:
Small organic molecule
Emp. Form.:
C14H9NO2S
Mol. Mass.:
255.292
SMILES:
OC1=NC(=O)C(S1)=Cc1ccc2ccccc2c1
: